{"text_format":"1","workbook":"xlsx","n_sheets":8,"sheets":["IMPRESION","LISTA","TEMPORAL","Configuracion","CIE","DEPARTAMENTO","PROVINCIA","DISTRITO"],"not_rendered":{"charts":0,"images":22,"macros":1,"external_links":0,"defined_names":11,"comments":0,"pivot_tables":0},"unopened":[],"bounds":{"document_bytes":16777216,"sheet_cells":100000,"rows_first":2000,"rows_last":500,"rows_between":2000,"halvings":0,"cell_chars":16384,"cell_head_chars":4096},"cells_cut":0,"cells_raw":0,"read":"whole","date_system":"1900"}

{"sheet":"IMPRESION","index":0,"n_rows":140,"n_cols":11,"rows_kept":140,"cut":false,"hidden":false,"merged":[[23,1,23,9],[33,4,33,5],[33,7,33,10],[27,4,27,10],[33,2,33,3],[28,7,28,9],[19,2,19,3],[19,4,19,6],[16,4,16,9],[19,7,19,9],[22,5,22,10],[69,2,69,4],[70,2,70,9],[45,3,45,7],[46,3,46,7],[36,7,36,9],[40,2,40,10],[50,2,54,10],[47,3,47,7],[49,2,49,9],[55,2,55,9],[65,3,65,4],[64,3,64,4],[56,2,56,4],[57,2,57,4],[68,2,68,4],[0,1,0,10],[71,2,77,10],[58,2,58,4],[59,2,59,4],[62,3,62,4],[63,3,63,4],[13,2,13,10],[24,2,24,10],[18,2,18,10],[27,2,27,3],[2,1,10,10],[44,3,44,7],[66,2,66,4],[67,2,67,4],[1,1,1,10],[34,4,34,10],[80,3,80,10],[101,5,107,5],[91,5,97,5],[91,2,97,2],[91,9,97,9],[81,2,87,2],[81,5,87,5],[81,9,87,9],[100,3,100,10],[90,3,90,10],[12,1,12,9],[17,4,17,9],[14,1,22,1],[29,5,29,10],[37,5,37,9],[20,4,20,10],[17,2,17,3],[34,2,34,3],[35,2,35,3],[35,4,35,10],[15,7,15,9],[20,2,20,3],[21,7,21,9],[15,4,15,5],[26,4,26,5],[26,7,26,9],[137,2,137,4],[121,7,121,8],[122,7,123,8],[79,1,79,10],[89,1,89,10],[99,1,99,10],[109,1,109,10],[118,2,118,9],[111,2,117,2],[111,9,117,9],[88,2,88,9],[110,3,110,10],[98,2,98,9],[108,2,108,9],[101,2,107,2],[101,9,107,9]]}
[null,"JUSTIFICACIÓN MÉDICA "]
[null,"PARA PACIENTE USUARIOS DE DERIVADOS DEL CANNABIS PARA USO MEDICINAL Y TERAPÉUTICO  ",null,"bron"]
[null,"Formato   orientado al  registro   de  información  que   respalda   la justificación   médica  en   pacientes  usuarios  de   derivados   del  cannabis,   inscritos    en  el  RENPUC y   perteneciente  a  una  determinada  asociación,  en   el   marco  de  la obtención   de   la  licencia  para  la producción  artesanal de derivados de cannabis con cultivo asociativo de la planta del género cannabis, con fines medicinales y terapéuticos.\nLa   justificación  médica  para   pacientes   usuarios   de  derivados   del    cannabis   para  uso  medicinal  y terapéutico debe   responder  al    código  de   ética y  deontología   del   Colegio Médico  del Perú,  ser   numerada  y  archivada  por   el   médico  tratante que  la genera  y debe  estar  disponible  para  las  acciones  de control posterior que corresponda. En caso se modifique   o  suspenda   el tratamiento   para   el  paciente,  el    médico   tratante   deberá   comunicar  este   hecho a la  Autoridad Nacional o Regional de Medicamentos, Insumos y Drogas. La información  presentada  en la presente justificación  médica  tiene  carácter de  declaración jurada , es  confidencial y  está  protegida  de  acuerdo  a la Ley Nº 29733 , Ley de Protección de Datos Personales."]
[]
[]
[]
[]
[]
[]
[]
[]
[null,"    I Datos del paciente usuario de derivados del cannabis con fines medicinal y terapéutico y/o datos del familiar del paciente."]
[]
[null,"1.1.","      PACIENTE"]
[null,null,"Nombre 1 :",null,"Nombre 2 :",null,"Apellido 1: ",null,"Apellido 2: "]
[null,null,"Edad:   ",null,"Tipo de Documento de Identidad:",null,"DNI"]
[null,null,"Registro RENPUC: N° ",null,{"$f":"IF(D17=\"\",\"INGRESAR NUMERO DE RENPUC\",\"\")","v":"INGRESAR NUMERO DE RENPUC"}]
[null,null,"Nombre de la Asociación a la que pertenece: "]
[null,null,""]
[null,null,"N° de Partida registral de la Asociación a la que pertenece: "]
[null,null,"Domicilio del paciente:"]
[null,null,"Departamento:","","Provincia:","","Distrito:",""]
[null,null,"Celular:","","Correo electrónico:"]
[]
[null,"1.2.  ","       TUTOR / FAMILIAR"]
[null,null,"Nombre 1 :",null,"Nombre 2 :",null,"Apellido 1: ",null,"Apellido 2: "]
[null,null,"Edad:   ",null,"Tipo de Documento de Identidad:",null,"DNI"]
[null,null,"Domicilio del tutor/familiar:"]
[null,null,"Departamento:","","Provincia:","","Distrito:",""]
[null,null,"Celular:",null,"Correo electrónico:"]
[]
[null,"II.    ","  Datos del médico cirujano tratante del paciente"]
[null,null,"Nombre 1 del  Médico tratante:",null,"Nombre 2 del  Médico tratante:",null,"Apellido 1 del  Médico tratante: ",null,"Apellido 2 del  Médico tratante: "]
[null,null,"N° de Colegiatura Profesional: ",null,null,null,"Especialidad:"]
[null,null,"Establecimiento de Salud:"]
[null,null,"Dirección del Establecimiento de Salud:"]
[null,null,"Departamento:","","Provincia:","","Distrito:",""]
[null,null,"Celular:",null,"Correo electrónico:"]
[]
[null,"III.     ","JUSTIFICACIÓN MÉDICA"]
[null,null,"Justificación del médico tratante en relación a la utilización de derivados del cannabis para uso medicinal y terapéutico por su paciente, realizada en base al conocimiento de los signos y síntomas que presenta, el examen médico realizado, la evaluación de los posibles riesgos e interacciones medicamentosas y teniendo en cuenta el beneficio/riesgo de su decisión terapéutica. "]
[null,null,"Esta   justificación médica debe formar parte de la Historia Clínica del paciente. "]
[]
[null,null,"3.1.","Diagnóstico(s) del paciente:"]
[null,null,"3.1.1.","",null,null,null,null,"CIE-10",{"$f":"_xlfn.IFNA(VLOOKUP(D45,CIE!$B$1:$C$113,2,FALSE),\"\")","v":""},"W16.1"]
[null,null,"3.1.2.","",null,null,null,null,"CIE-10",{"$f":"_xlfn.IFNA(VLOOKUP(D46,CIE!$B$1:$C$113,2,FALSE),\"\")","v":""},"W16.1"]
[null,null,"3.1.3.","",null,null,null,null,"CIE-10",{"$f":"_xlfn.IFNA(VLOOKUP(D47,CIE!$B$1:$C$113,2,FALSE),\"\")","v":""},"W16.1"]
[null,null,"3.1.4.","",null,null,null,null,"CIE-10",{"$f":"_xlfn.IFNA(VLOOKUP(D48,CIE!$B$1:$C$113,2,FALSE),\"\")","v":""},"W16.1"]
[]
[null,"3.2.       ","  Tratamiento farmacológico que recibe el paciente:"]
[]
[]
[]
[]
[]
[null,"3.3.        "," Antecedentes clínicos del paciente  :"]
[null,"3.3.1.","Presenta arritmia  :"]
[null,"3.3.2.","Presenta angina de pecho / angor : "]
[null,"3.3.3.","Presenta hipertensión no controlada : "]
[null,"3.3.4.","Presenta problemas de salud mental : "]
{"$rows_left_out":81}
{"sheet":"LISTA","index":1,"n_rows":1,"n_cols":68,"rows_kept":1,"cut":false,"hidden":false,"merged":[]}
["PACNOMBRE1","PACNOMBRE2","PACAPEPAT","PACAPEMAT","ACPEDAD","TIDCODIGOPAC","PACNUMDOC","PACCODDJV","PACDIRECCION","PACDEPARTAMENTO","PACPROVINCIA","PACDISTRITO","PACTELEFONO","PACRESPNOMBRE1","PACRESPNOMBRE2","PACRESPAPEPAT","PACRESPAPEMAT","PACRESPNUMDOC","PACRESPDIRECCION","PACDEPARTAMENTO","PACPROVINCIA","PACDISTRITO","PACRESPTELEFONO","MEDNOMBRE1","MEDNOMBRE2","MEDAPEPAT","MEDAPEMAT","MEDNUMCMP","MEDESPECIALIDAD","MEDESTABPUB","MEDDIRESTABPUB","MEDDEPARTAMENTO","MEDPROVINCIA","MEDDISTRITO","MEDTELMOVIL","MEDCORREO","ACPIDCIE10_1","ACPIDCIE10_2","ACPIDCIE10_3","ACPIDCIE10_4","ACPTRAFARMACOLOGICO","ACPANTCLI01","ACPANTCLI02","ACPANTCLI03","ACPANTCLI04","ACPANTCLI05","ACPANTCLI06","ACPANTCLI07","ACPANTCLI08","ACPANTCLI09","ACPANTCLI10","ACPANTCLI11","ACPANTCLI12","JMTDESCRIPCION","DCPDESCRIPCION","DCPCONCANTIPOUMED","DCPCONCANNTHC","DCPCONCANNCBG","DCPCONCANNCBN","DCPCONCANNCBD","DCPCONCANNOTRO","DCPVOLUMEN","DCPVIAADM","DCPDOSISTIPO","DCPDOSISCANT","DCPFREDIA","DCPDURTRA","PACCODDJV"]

{"sheet":"TEMPORAL","index":2,"n_rows":5,"n_cols":68,"rows_kept":5,"cut":false,"hidden":false,"merged":[]}
["PACNOMBRE1","PACNOMBRE2","PACAPEPAT","PACAPEMAT","ACPEDAD","TIDCODIGOPAC","PACNUMDOC","PACCODDJV","PACDIRECCION","PACDEPARTAMENTO","PACPROVINCIA","PACDISTRITO","PACTELEFONO","PACRESPNOMBRE1","PACRESPNOMBRE2","PACRESPAPEPAT","PACRESPAPEMAT","PACRESPNUMDOC","PACRESPDIRECCION","PACDEPARTAMENTO","PACPROVINCIA","PACDISTRITO","PACRESPTELEFONO","MEDNOMBRE1","MEDNOMBRE2","MEDAPEPAT","MEDAPEMAT","MEDNUMCMP","MEDESPECIALIDAD","MEDESTABPUB","MEDDIRESTABPUB","MEDDEPARTAMENTO","MEDPROVINCIA","MEDDISTRITO","MEDTELMOVIL","MEDCORREO","ACPIDCIE10_1","ACPIDCIE10_2","ACPIDCIE10_3","ACPIDCIE10_4","ACPTRAFARMACOLOGICO","ACPANTCLI01","ACPANTCLI02","ACPANTCLI03","ACPANTCLI04","ACPANTCLI05","ACPANTCLI06","ACPANTCLI07","ACPANTCLI08","ACPANTCLI09","ACPANTCLI10","ACPANTCLI11","ACPANTCLI12","JMTDESCRIPCION","DCPDESCRIPCION","DCPCONCANTIPOUMED","DCPCONCANNTHC","DCPCONCANNCBD","DCPCONCANNCBG","DCPCONCANNCBN","DCPCONCANNOTRO","DCPVOLUMEN","DCPVIAADM","DCPDOSISTIPO","DCPDOSISCANT","DCPFREDIA","DCPDURTRA","PACCODDJV"]
[{"$f":"IMPRESION!D15","v":0},{"$f":"IMPRESION!F15","v":0},{"$f":"IMPRESION!H15","v":0},{"$f":"IMPRESION!J15","v":0},{"$f":"IMPRESION!D16","v":0},{"$f":"IMPRESION!G16","v":"DNI"},{"$f":"IMPRESION!H16","v":0},{"$f":"IMPRESION!D17","v":0},{"$f":"IMPRESION!E21","v":0},{"$f":"IMPRESION!D22","v":""},{"$f":"IMPRESION!F22","v":""},{"$f":"IMPRESION!H22","v":""},{"$f":"IMPRESION!D23","v":""},{"$f":"IMPRESION!D26","v":0},{"$f":"IMPRESION!F26","v":0},{"$f":"IMPRESION!H26","v":0},{"$f":"IMPRESION!J26","v":0},{"$f":"IMPRESION!H27","v":0},{"$f":"IMPRESION!E28","v":0},{"$f":"IMPRESION!D29","v":""},{"$f":"IMPRESION!F29","v":""},{"$f":"IMPRESION!H29","v":""},{"$f":"IMPRESION!D30","v":0},{"$f":"IMPRESION!D33","v":0},{"$f":"IMPRESION!F33","v":0},{"$f":"IMPRESION!H33","v":0},{"$f":"IMPRESION!J33","v":0},{"$f":"IMPRESION!E34","v":0},{"$f":"IMPRESION!H34","v":0},{"$f":"IMPRESION!E35","v":0},{"$f":"IMPRESION!E36","v":0},0,0,0,{"$f":"IMPRESION!D38","v":0},{"$f":"IMPRESION!F38","v":0},{"$f":"IMPRESION!J45","v":""},{"$f":"IMPRESION!J46","v":""},{"$f":"IMPRESION!J47","v":""},{"$f":"IMPRESION!J48","v":""},{"$f":"IMPRESION!C51","v":0},-1,-1,-1,-1,-1,-1,-1,{"$f":"IMPRESION!F66","v":0},-1,-1,-1,{"$f":"IMPRESION!F70","v":0},{"$f":"IMPRESION!C72","v":0},{"$f":"IMPRESION!D81","v":0},{"$f":"IMPRESION!E82","v":"Seleccionar"},{"$f":"IMPRESION!E83","v":0},{"$f":"IMPRESION!E84","v":0},{"$f":"IMPRESION!E85","v":0},{"$f":"IMPRESION!E86","v":0},{"$f":"IMPRESION!E87","v":0},{"$f":"IMPRESION!E88","v":0},{"$f":"IMPRESION!H82","v":"Seleccionar"},{"$f":"IMPRESION!I84","v":"Seleccionar"},{"$f":"IMPRESION!H84","v":0},{"$f":"IMPRESION!H85","v":0},{"$f":"IMPRESION!H86","v":0},{"$f":"IMPRESION!D17","v":0}]
[null,null,null,null,null,null,null,null,null,null,null,null,null,null,null,null,null,null,null,null,null,null,null,null,null,null,null,null,null,null,null,null,null,null,null,null,null,null,null,null,null,null,null,null,null,null,null,null,null,null,null,null,null,null,{"$f":"IMPRESION!D91","v":0},{"$f":"IMPRESION!E92","v":"Seleccionar"},{"$f":"IMPRESION!E93","v":0},{"$f":"IMPRESION!E94","v":0},{"$f":"IMPRESION!E95","v":0},{"$f":"IMPRESION!E96","v":0},{"$f":"IMPRESION!E97","v":0},{"$f":"IMPRESION!E98","v":0},{"$f":"IMPRESION!H92","v":"Seleccionar"},{"$f":"IMPRESION!I94","v":"Seleccionar"},{"$f":"IMPRESION!H94","v":0},{"$f":"IMPRESION!H95","v":0},{"$f":"IMPRESION!H96","v":0},{"$f":"IMPRESION!D17","v":0}]
[null,null,null,null,null,null,null,null,null,null,null,null,null,null,null,null,null,null,null,null,null,null,null,null,null,null,null,null,null,null,null,null,null,null,null,null,null,null,null,null,null,null,null,null,null,null,null,null,null,null,null,null,null,null,{"$f":"IMPRESION!D101","v":0},{"$f":"IMPRESION!E102","v":"Seleccionar"},{"$f":"IMPRESION!E103","v":0},{"$f":"IMPRESION!E104","v":0},{"$f":"IMPRESION!E105","v":0},{"$f":"IMPRESION!E106","v":0},{"$f":"IMPRESION!E107","v":0},{"$f":"IMPRESION!E108","v":0},{"$f":"IMPRESION!H102","v":"Seleccionar"},{"$f":"IMPRESION!I104","v":"Seleccionar"},{"$f":"IMPRESION!H104","v":0},{"$f":"IMPRESION!H105","v":0},{"$f":"IMPRESION!H106","v":0},{"$f":"IMPRESION!D17","v":0}]
[null,null,null,null,null,null,null,null,null,null,null,null,null,null,null,null,null,null,null,null,null,null,null,null,null,null,null,null,null,null,null,null,null,null,null,null,null,null,null,null,null,null,null,null,null,null,null,null,null,null,null,null,null,null,{"$f":"IMPRESION!D111","v":0},{"$f":"IMPRESION!E112","v":"Seleccionar"},{"$f":"IMPRESION!E113","v":0},{"$f":"IMPRESION!E114","v":0},{"$f":"IMPRESION!E115","v":0},{"$f":"IMPRESION!E116","v":0},{"$f":"IMPRESION!E117","v":0},{"$f":"IMPRESION!E118","v":0},{"$f":"IMPRESION!H112","v":"Seleccionar"},{"$f":"IMPRESION!I114","v":"Seleccionar"},{"$f":"IMPRESION!H114","v":0},{"$f":"IMPRESION!H115","v":0},{"$f":"IMPRESION!H116","v":0},{"$f":"IMPRESION!D17","v":0}]

{"sheet":"Configuracion","index":3,"n_rows":1890,"n_cols":18,"rows_kept":1890,"cut":false,"hidden":true,"merged":[]}
[]
[]
[null,"DPTDESCRIP","PRVDESCRIP","DISDESCRIP",null,4,2,4]
[null,null,"AMAZONAS","CHACHAPOYAS",null,null,null,null,null,null,null,"THC, CBG, CBN, CBD u otro "]
[null,"AMAZONAS","CHACHAPOYAS","CHACHAPOYAS"]
[null,"AMAZONAS","CHACHAPOYAS","ASUNCION"]
[null,"AMAZONAS","CHACHAPOYAS","BALSAS"]
[null,"AMAZONAS","CHACHAPOYAS","CHETO",null,null,null,null,null,null,"Unidad","unidad de medida volumen","via administracion","concentracion","Pregunta","Dosis","Tiempo","Tipo de documento"]
[null,"AMAZONAS","CHACHAPOYAS","CHILIQUIN",null,null,null,null,null,null,"Seleccionar","ml","Seleccionar","Seleccionar","Seleccionar","Seleccionar","Seleccionar","Seleccionar"]
[null,"AMAZONAS","CHACHAPOYAS","CHUQUIBAMBA",null,null,null,null,null,null,"mg/mL",null,"Vía oral","mg/mL(THC)","Si ","Gotas","Dia(s)","DNI"]
[null,"AMAZONAS","CHACHAPOYAS","GRANADA",null,null,null,null,null,null,"mg/g",null,"Vía Tópica","mg/mL(CBD)","No","mL",null,"C.E"]
[null,"AMAZONAS","CHACHAPOYAS","HUANCAS",null,null,null,null,null,null,"%",null,"Vía sublingual","mg/mL(CBG)",null,"g",null,"PASAPORTE"]
[null,"AMAZONAS","CHACHAPOYAS","LA JALCA",null,null,null,null,null,null,null,null,"Vía inhalatoria","mg/mL(CBN)"]
[null,"AMAZONAS","CHACHAPOYAS","LEIMEBAMBA",null,null,null,null,null,null,null,null,null,"THC(%)"]
[null,"AMAZONAS","CHACHAPOYAS","LEVANTO",null,null,null,null,null,null,null,null,null,"CBD(%)"]
[null,"AMAZONAS","CHACHAPOYAS","MAGDALENA",null,null,null,null,null,null,null,null,null,"CBG(%)"]
[null,"AMAZONAS","CHACHAPOYAS","MARISCAL CASTILLA",null,null,null,null,null,null,null,"Calculo de volumen ",null,"CBN(%)"]
[null,"AMAZONAS","CHACHAPOYAS","MOLINOPAMPA",null,null,null,null,null,null,null,null,null,"Otro",null,null,"Documento de Identidad: DNI / C.E. / Pasaporte N°:"]
[null,"AMAZONAS","CHACHAPOYAS","MONTEVIDEO"]
[null,"AMAZONAS","CHACHAPOYAS","OLLEROS"]
[null,"AMAZONAS","CHACHAPOYAS","QUINJALCA"]
[null,"AMAZONAS","CHACHAPOYAS","SAN FRANCISCO DE DAGUAS"]
[null,"AMAZONAS","CHACHAPOYAS","SAN ISIDRO DE MAINO"]
[null,"AMAZONAS","CHACHAPOYAS","SOLOCO"]
[null,"AMAZONAS","CHACHAPOYAS","SONCHE"]
[]
[null,"AMAZONAS","BAGUA","LA PECA"]
[null,"AMAZONAS","BAGUA","ARAMANGO"]
[null,"AMAZONAS","BAGUA","COPALLIN"]
[null,"AMAZONAS","BAGUA","EL PARCO"]
[null,"AMAZONAS","BAGUA","IMAZA"]
[null,"AMAZONAS","BAGUA","BAGUA"]
[]
[null,"AMAZONAS","BONGARA","JUMBILLA"]
[null,"AMAZONAS","BONGARA","CHISQUILLA"]
[null,"AMAZONAS","BONGARA","CHURUJA"]
[null,"AMAZONAS","BONGARA","COROSHA"]
[null,"AMAZONAS","BONGARA","CUISPES"]
[null,"AMAZONAS","BONGARA","FLORIDA"]
[null,"AMAZONAS","BONGARA","JAZAN"]
[null,"AMAZONAS","BONGARA","RECTA"]
[null,"AMAZONAS","BONGARA","SAN CARLOS"]
[null,"AMAZONAS","BONGARA","SHIPASBAMBA"]
[null,"AMAZONAS","BONGARA","VALERA"]
[null,"AMAZONAS","BONGARA","YAMBRASBAMBA"]
[]
[null,"AMAZONAS","CONDORCANQUI","NIEVA"]
[null,"AMAZONAS","CONDORCANQUI","EL CENEPA"]
[null,"AMAZONAS","CONDORCANQUI","RIO SANTIAGO"]
[]
[null,"AMAZONAS","LUYA","LAMUD"]
[null,"AMAZONAS","LUYA","CAMPORREDONDO"]
[null,"AMAZONAS","LUYA","COCABAMBA"]
[null,"AMAZONAS","LUYA","COLCAMAR"]
[null,"AMAZONAS","LUYA","CONILA"]
[null,"AMAZONAS","LUYA","INGUILPATA"]
[null,"AMAZONAS","LUYA","LONGUITA"]
[null,"AMAZONAS","LUYA","LONYA CHICO"]
[null,"AMAZONAS","LUYA","LUYA"]
[null,"AMAZONAS","LUYA","LUYA VIEJO"]
{"$rows_left_out":1831}
{"sheet":"CIE","index":4,"n_rows":113,"n_cols":3,"rows_kept":113,"cut":false,"hidden":true,"merged":[]}
["R630","ANOREXIA","R630"]
["F500","ANOREXIA NERVIOSA","F500"]
["F501","ANOREXIA NERVIOSA ATIPICA","F501"]
["M139","ARTRITIS, NO ESPECIFICADA","M139"]
["M189","ARTROSIS DE LA PRIMERA ARTICULACION CARPOMETACARPIANA, SIN OTRA ESPECIFICACION","M189"]
["M182","ARTROSIS POSTRAUMATICA DE LA PRIMERA ARTICULACION CARPOMETACARPIANA, BILATERAL","M182"]
["M191","ARTROSIS POSTRAUMATICA DE OTRAS ARTICULACIONES","M191"]
["M180","ARTROSIS PRIMARIA DE LA PRIMERA ARTICULACION CARPOMETACARPIANA, BILATERAL","M180"]
["M190","ARTROSIS PRIMARIA DE OTRAS ARTICULACIONES","M190"]
["M192","ARTROSIS SECUNDARIA DE OTRAS ARTICULACIONES","M192"]
["M199","ARTROSIS, NO ESPECIFICADA","M199"]
["G406","ATAQUES DE GRAN MAL, NO ESPECIFICADOS (CON O SIN PEQUEÑO MAL)","G406"]
["Z542","CONVALECENCIA CONSECUTIVA A QUIMIOTERAPIA","Z542"]
["E124","DIABETES MELLITUS ASOCIADA CON DESNUTRICION CON COMPLICACIONES NEUROLOGICAS","E124"]
["E104","DIABETES MELLITUS INSULINODEPENDIENTE CON COMPLICACIONES NEUROLOGICAS","E104"]
["E114","DIABETES MELLITUS NO INSULINODEPENDIENTE CON COMPLICACIONES NEUROLOGICAS","E114"]
["E144","DIABETES MELLITUS, NO ESPECIFICADA CON COMPLICACIONES NEUROLOGICAS","E144"]
["R520","DOLOR AGUDO","R520"]
["R521","DOLOR CRONICO INTRATABLE","R521"]
["R529","DOLOR, NO ESPECIFICADO","R529"]
["Y570","EFECTOS ADVERSOS DE DEPRESORES DEL APETITO [ANOREXICOS]","Y570"]
["G20","ENFERMEDAD DE PARKINSON","G20"]
["B220","ENFERMEDAD POR VIH, RESULTANTE EN ENCEFALOPATIA","B220"]
["B222","ENFERMEDAD POR VIH, RESULTANTE EN SINDROME CAQUECTICO","B222"]
["B24","ENFERMEDAD POR VIRUS DE LA INMUNODEFICIENCIA HUMANA (VIH), SIN OTRA ESPECIFICACION","B24"]
["G403","EPILEPSIA Y SINDROMES EPILEPTICOS IDIOPATICOS GENERALIZADOS","G403"]
["G400","EPILEPSIA Y SINDROMES EPILEPTICOS IDIOPATICOS RELACIONADOS CON LOCALIZACIONES (FOCALES) (PARCIALES) Y CON ATAQUES DE INICIO LOCALIZADO","G400"]
["G402","EPILEPSIA Y SINDROMES EPILEPTICOS SINTOMATICOS RELACIONADOS CON LOCALIZACIONES (FOCALES) (PARCIALES) Y CON ATAQUES PARCIALES COMPLEJOS","G402"]
["G401","EPILEPSIA Y SINDROMES EPILEPTICOS SINTOMATICOS RELACIONADOS CON LOCALIZACIONES (FOCALES) (PARCIALES) Y CON ATAQUES PARCIALES SIMPLES","G401"]
["G409","EPILEPSIA, TIPO NO ESPECIFICADO","G409"]
["G375","ESCLEROSIS CONCENTRICA (BALO)","G375"]
["G370","ESCLEROSIS DIFUSA","G370"]
["G35","ESCLEROSIS MULTIPLE","G35"]
["G410","ESTADO DE GRAN MAL EPILEPTICO","G410"]
["G419","ESTADO DE MAL EPILEPTICO DE TIPO NO ESPECIFICADO","G419"]
["G412","ESTADO DE MAL EPILEPTICO PARCIAL COMPLEJO","G412"]
["G411","ESTADO DE PEQUEÑO MAL EPILEPTICO","G411"]
["A89","INFECCION VIRAL DEL SISTEMA NERVIOSO CENTRAL, NO ESPECIFICADA","A89"]
["A819","INFECCIONES DEL SISTEMA NERVIOSO CENTRAL POR VIRUS ATIPICO, SIN OTRA ESPECIFICACION","A819"]
["A812","LEUCOENCEFALOPATIA MULTIFOCAL PROGRESIVA","A812"]
["M131","MONOARTRITIS, NO CLASIFICADA EN OTRA PARTE","M131"]
["G589","MONONEUROPATIA, NO ESPECIFICADA","G589"]
["G130","NEUROMIOPATIA Y NEUROPATIA PARANEOPLASICA","G130"]
["G602","NEUROPATIA ASOCIADA CON ATAXIA HEREDITARIA","G602"]
["G609","NEUROPATIA HEREDITARIA E IDIOPATICA, SIN OTRA ESPECIFICACION","G609"]
["G603","NEUROPATIA PROGRESIVA IDIOPATICA","G603"]
["G600","NEUROPTIA HEREDITARIA MOTORA Y SENSORIAL","G600"]
["M138","OTRAS ARTRITIS ESPECIFICADAS","M138"]
["M198","OTRAS ARTROSIS ESPECIFICADAS","M198"]
["M183","OTRAS ARTROSIS POSTRAUMATICAS DE LA PRIMERA ARTICULACION CARPOMETACARPIANA","M183"]
["M181","OTRAS ARTROSIS PRIMARIAS DE LA PRIMERA ARTICULACION CARPOMETACARPIANA","M181"]
["M185","OTRAS ARTROSIS SECUNDARIAS DE LA PRIMERA ARTICULACION CARPOMETACARPIANA","M185"]
["M184","OTRAS ARTROSIS SECUNDARIAS DE LA PRIMERA ARTICULACION CARPOMETACARPIANA, BILATERALES","M184"]
["E134","OTRAS DIABETES MELLITUS ESPECIFICADAS CON COMPLICACIONES NEUROLOGICAS","E134"]
["G408","OTRAS EPILEPSIAS","G408"]
["G404","OTRAS EPILEPSIAS Y SINDROMES EPILEPTICOS GENERALIZADOS","G404"]
["A818","OTRAS INFECCIONES DEL SISTEMA NERVIOSO POR VIRUS ATIPICO","A818"]
["A888","OTRAS INFECCIONES VIRALES ESPECIFICADAS DEL SISTEMA NERVIOSO CENTRAL","A888"]
["G608","OTRAS NEUROPATIAS HEREDITARIAS E IDIOPATICAS","G608"]
["R522","OTRO DOLOR CRONICO","R522"]
{"$rows_left_out":54}
{"sheet":"DEPARTAMENTO","index":5,"n_rows":26,"n_cols":2,"rows_kept":26,"cut":false,"hidden":true,"merged":[]}
["CÓDIGO DEPARTAMENTO","Departamento"]
[1,"AMAZONAS"]
[2,"ANCASH"]
[3,"APURIMAC"]
[4,"AREQUIPA"]
[5,"AYACUCHO"]
[6,"CAJAMARCA"]
[7,"CALLAO"]
[8,"CUSCO"]
[9,"HUANCAVELICA"]
[10,"HUANUCO"]
[11,"ICA"]
[12,"JUNIN"]
[13,"LA LIBERTAD"]
[14,"LAMBAYEQUE"]
[15,"LIMA"]
[16,"LORETO"]
[17,"MADRE DE DIOS"]
[18,"MOQUEGUA"]
[19,"PASCO"]
[20,"PIURA"]
[21,"PUNO"]
[22,"SAN MARTIN"]
[23,"TACNA"]
[24,"TUMBES"]
[25,"UCAYALI"]

{"sheet":"PROVINCIA","index":6,"n_rows":198,"n_cols":3,"rows_kept":198,"cut":false,"hidden":true,"merged":[]}
["CÓDIGO DEPARTAMENTO","CÓDIGO PROVINCIA","Provincia"]
[1,1,"CHACHAPOYAS"]
[1,2,"BAGUA"]
[1,3,"BONGARA"]
[1,4,"CONDORCANQUI"]
[1,5,"LUYA"]
[1,6,"RODRIGUEZ DE MENDOZA"]
[1,7,"UTCUBAMBA"]
[2,1,"HUARAZ"]
[2,2,"AIJA"]
[2,3,"ANTONIO RAYMONDI"]
[2,4,"ASUNCION"]
[2,5,"BOLOGNESI"]
[2,6,"CARHUAZ"]
[2,7,"CARLOS FERMIN FITZCARRALD"]
[2,8,"CASMA"]
[2,9,"CORONGO"]
[2,10,"HUARI"]
[2,11,"HUARMEY"]
[2,12,"HUAYLAS"]
[2,13,"MARISCAL LUZURIAGA"]
[2,14,"OCROS"]
[2,15,"PALLASCA"]
[2,16,"POMABAMBA"]
[2,17,"RECUAY"]
[2,18,"SANTA"]
[2,19,"SIHUAS"]
[2,20,"YUNGAY"]
[3,1,"ABANCAY"]
[3,2,"ANDAHUAYLAS"]
[3,3,"ANTABAMBA"]
[3,4,"AYMARAES"]
[3,5,"COTABAMBAS"]
[3,6,"CHINCHEROS"]
[3,7,"GRAU"]
[4,1,"AREQUIPA"]
[4,2,"CAMANA"]
[4,3,"CARAVELI"]
[4,4,"CASTILLA"]
[4,5,"CAYLLOMA"]
[4,6,"CONDESUYOS"]
[4,7,"ISLAY"]
[4,8,"LA UNION"]
[5,1,"HUAMANGA"]
[5,2,"CANGALLO"]
[5,3,"HUANCA SANCOS"]
[5,4,"HUANTA"]
[5,5,"LA MAR"]
[5,6,"LUCANAS"]
[5,7,"PARINACOCHAS"]
[5,8,"PAUCAR DEL SARA SARA"]
[5,9,"SUCRE"]
[5,10,"VICTOR FAJARDO"]
[5,10,"VICTOR FAFARDO"]
[5,11,"VILCAS HUAMAN"]
[6,1,"CAJAMARCA"]
[6,2,"CAJABAMBA"]
[6,3,"CELENDIN"]
[6,4,"CHOTA"]
[6,5,"CONTUMAZA"]
{"$rows_left_out":139}
{"sheet":"DISTRITO","index":7,"n_rows":1835,"n_cols":7,"rows_kept":1835,"cut":false,"hidden":true,"merged":[]}
["CÓDIGO DEPARTAMENTO","CÓDIGO PROVINCIA","CÓDIGO DISTRITO","Distrito"]
[1,1,1,"CHACHAPOYAS"]
[1,1,2,"ASUNCION"]
[1,1,3,"BALSAS"]
[1,1,4,"CHETO",null,null,{"$f":"IMPRESION!D29","v":""}]
[1,1,5,"CHILIQUIN"]
[1,1,6,"CHUQUIBAMBA"]
[1,1,7,"GRANADA"]
[1,1,8,"HUANCAS"]
[1,1,9,"LA JALCA"]
[1,1,10,"LEIMEBAMBA"]
[1,1,11,"LEVANTO"]
[1,1,12,"MAGDALENA"]
[1,1,13,"MARISCAL CASTILLA"]
[1,1,14,"MOLINOPAMPA"]
[1,1,15,"MONTEVIDEO"]
[1,1,16,"OLLEROS"]
[1,1,17,"QUINJALCA"]
[1,1,18,"SAN FRANCISCO DE DAGUAS"]
[1,1,19,"SAN ISIDRO DE MAINO"]
[1,1,20,"SOLOCO"]
[1,1,21,"SONCHE"]
[1,2,1,"LA PECA"]
[1,2,2,"ARAMANGO"]
[1,2,3,"COPALLIN"]
[1,2,4,"EL PARCO"]
[1,2,5,"IMAZA"]
[1,2,6,"BAGUA"]
[1,3,1,"JUMBILLA"]
[1,3,2,"CHISQUILLA"]
[1,3,3,"CHURUJA"]
[1,3,4,"COROSHA"]
[1,3,5,"CUISPES"]
[1,3,6,"FLORIDA"]
[1,3,7,"JAZAN"]
[1,3,8,"RECTA"]
[1,3,9,"SAN CARLOS"]
[1,3,10,"SHIPASBAMBA"]
[1,3,11,"VALERA"]
[1,3,12,"YAMBRASBAMBA"]
[1,4,1,"NIEVA"]
[1,4,2,"EL CENEPA"]
[1,4,3,"RIO SANTIAGO"]
[1,5,1,"LAMUD"]
[1,5,2,"CAMPORREDONDO"]
[1,5,3,"COCABAMBA"]
[1,5,4,"COLCAMAR"]
[1,5,5,"CONILA"]
[1,5,6,"INGUILPATA"]
[1,5,7,"LONGUITA"]
[1,5,8,"LONYA CHICO"]
[1,5,9,"LUYA"]
[1,5,10,"LUYA VIEJO"]
[1,5,11,"MARIA"]
[1,5,12,"OCALLI"]
[1,5,13,"OCUMAL"]
[1,5,14,"PISUQUIA"]
[1,5,15,"PROVIDENCIA"]
[1,5,16,"SAN CRISTOBAL"]
[1,5,17,"SAN FRANCISCO DEL YESO"]
{"$rows_left_out":1775}